LINUXSOFT.cz Přeskoč levou lištu
Uživatel: Heslo:  
   CZUKPL

> Diskuze: článek Counter Strike v Linuxe

Graficka ATI MOBILITY RADEON 9000 v Acer Aspire 1605DLC
(link)
11.4.2004 13:09
Croow

Mno s instalaci jsem skoncil u nainstalovani graficke karty.
Mam Ati Mobility Radeon 9000 na notebooku Acer Aspire 1605DLC kdybyste s tim mel nejake zkusenosti byl bych vdecen za pomoc, jinak zustanu u rebootovani do win :o( D.

Re: Graficka ATI MOBILITY RADEON 9000 v Acer Aspire 1605DLC
(link)
12.4.2004 16:17
Jaroslav Imrich
Věk: ( ~35 let)

Na ati.com pisu ze drivery pre mobilne cipy poskytuje vyrobca notebooku avsak prezrel som aj ftp na acer.com a ovladace pre linux som nenasiel :( Byt vami urcite by som vyskusal ovladace z www.ati.com ktore najdete v sekcii Drivers - Linux - Graphics Driver - Radeon 9000

Soustenie wine
(link)
24.11.2004 19:57
ijohny

neviete niekto preco po spusteni prikazu wine mi konzola vypise: "wine: exists lstat socket : No such file or directory
"
Dakujem

Error pri \\\\\\\\
(link)
23.2.2007 23:22
Filip Cizek
Věk: ( ~27 let)
Mam mensi problem pri kompilaci, mohl by mi nekdo poradit? Errory zacinaji zde:
./ppl.l:82:1: warning: "/*" within comment
./ppl.l:91:2: error: #endif without #if
./ppl.l: In function ‘pplex’:
./ppl.l:305: error: ‘seen_junk’ undeclared (first use in this function)
./ppl.l:305: error: (Each undeclared identifier is reported only once
./ppl.l:305: error: for each function it appears in.)
./ppl.l:305: error: ‘pp_pp’ undeclared (first use in this function)
./ppl.l:310: error: ‘pp_ignore’ undeclared (first use in this function)
./ppl.l:310: warning: implicit declaration of function ‘yy_pp_state’
./ppl.l:310: error: ‘pp_inc’ undeclared (first use in this function)
./ppl.l:310: error: ‘tINCLUDE’ undeclared (first use in this function)
./ppl.l:310: error: ‘pp_eol’ undeclared (first use in this function)
./ppl.l:311: error: called object ‘yy_current_state’ is not a function
./ppl.l:311: error: ‘pp_def’ undeclared (first use in this function)
./ppl.l:312: error: ‘tERROR’ undeclared (first use in this function)
./ppl.l:313: error: ‘tWARNING’ undeclared (first use in this function)
./ppl.l:314: error: ‘tPRAGMA’ undeclared (first use in this function)
./ppl.l:315: error: ‘tPPIDENT’ undeclared (first use in this function)
./ppl.l:316: error: ‘pp_ifd’ undeclared (first use in this function)
./ppl.l:316: error: ‘tUNDEF’ undeclared (first use in this function)
./ppl.l:317: error: ‘tIFDEF’ undeclared (first use in this function)
./ppl.l:318: error: ‘tIFNDEF’ undeclared (first use in this function)
./ppl.l:319: error: ‘pp_if’ undeclared (first use in this function)
./ppl.l:319: error: ‘tIF’ undeclared (first use in this function)
./ppl.l:320: error: ‘tELIF’ undeclared (first use in this function)
./ppl.l:321: error: ‘tELSE’ undeclared (first use in this function)
./ppl.l:322: error: ‘tENDIF’ undeclared (first use in this function)
./ppl.l:323: error: ‘pp_line’ undeclared (first use in this function)
./ppl.l:323: error: ‘tLINE’ undeclared (first use in this function)
./ppl.l:324: error: ‘tGCCLINE’ undeclared (first use in this function)
./ppl.l:325: warning: implicit declaration of function ‘pperror’
./ppl.l:326: warning: implicit declaration of function ‘newline’
./ppl.l:326: error: ‘tNL’ undeclared (first use in this function)
./ppl.l:334: warning: implicit declaration of function ‘make_number’
./ppl.l:334: error: ‘pplval’ undeclared (first use in this function)
./ppl.l:335: warning: implicit declaration of function ‘new_string’
./ppl.l:335: warning: implicit declaration of function ‘add_string’
./ppl.l:335: error: ‘pp_iqs’ undeclared (first use in this function)
./ppl.l:336: error: ‘pp_dqs’ undeclared (first use in this function)
./ppl.l:340: error: called object ‘yy_current_state’ is not a function
./ppl.l:362: error: ‘pp_defined’ undeclared (first use in this function)
./ppl.l:362: error: ‘tDEFINED’ undeclared (first use in this function)
./ppl.l:363: error: ‘tLSHIFT’ undeclared (first use in this function)
./ppl.l:364: error: ‘tRSHIFT’ undeclared (first use in this function)
./ppl.l:365: error: ‘tLOGAND’ undeclared (first use in this function)
./ppl.l:366: error: ‘tLOGOR’ undeclared (first use in this function)
./ppl.l:367: error: ‘tEQ’ undeclared (first use in this function)
./ppl.l:368: error: ‘tNE’ undeclared (first use in this function)
./ppl.l:369: error: ‘tLTE’ undeclared (first use in this function)
./ppl.l:370: error: ‘tGTE’ undeclared (first use in this function)
./ppl.l:375: error: ‘pp_sqs’ undeclared (first use in this function)
./ppl.l:383: warning: implicit declaration of function ‘xstrdup’
./ppl.l:383: error: ‘tIDENT’ undeclared (first use in this function)
./ppl.l:406: error: ‘tLITERAL’ undeclared (first use in this function)
./ppl.l:409: error: called object ‘yy_current_state’ is not a function
./ppl.l:415: error: ‘pp_macro’ undeclared (first use in this function)
./ppl.l:415: error: ‘tMACRO’ undeclared (first use in this function)
./ppl.l:416: error: ‘pp_define’ undeclared (first use in this function)
./ppl.l:416: error: ‘tDEFINE’ undeclared (first use in this function)
./ppl.l:435: error: ‘pp_mbody’ undeclared (first use in this function)
./ppl.l:435: error: ‘tMACROEND’ undeclared (first use in this function)
./ppl.l:439: error: ‘tELIPSIS’ undeclared (first use in this function)
./ppl.l:448: error: ‘tCONCAT’ undeclared (first use in this function)
./ppl.l:449: error: ‘tSTRINGIZE’ undeclared (first use in this function)
./ppl.l:467: error: ‘pp_macscan’ undeclared (first use in this function)
./ppl.l:474: error: ‘macexpstackentry_t’ undeclared (first use in this function)
./ppl.l:474: error: ‘mac’ undeclared (first use in this function)
./ppl.l:474: warning: implicit declaration of function ‘pop_macro’
./ppl.l:476: warning: implicit declaration of function ‘put_buffer’
./ppl.l:478: warning: implicit declaration of function ‘free_macro’
./ppl.l:486: warning: implicit declaration of function ‘MACROPARENTHESES’
./ppl.l:486: error: invalid lvalue in increment
./ppl.l:487: warning: implicit declaration of function ‘add_text_to_macro’
./ppl.l:490: error: invalid lvalue in decrement
./ppl.l:493: warning: implicit declaration of function ‘macro_add_arg’
./ppl.l:506: error: ‘pp_comment’ undeclared (first use in this function)
./ppl.l:507: error: ‘line_number’ undeclared (first use in this function)
./ppl.l:507: error: ‘char_number’ undeclared (first use in this function)
./ppl.l:524: warning: implicit declaration of function ‘ppwarning’
./ppl.l:536: error: called object ‘yy_current_state’ is not a function
./ppl.l:543: error: ‘RCINCL’ undeclared (first use in this function)
./ppl.l:544: error: called object ‘yy_current_state’ is not a function
./ppl.l:545: warning: implicit declaration of function ‘get_string’
./ppl.l:546: error: ‘tDQSTRING’ undeclared (first use in this function)
./ppl.l:548: warning: implicit declaration of function ‘put_string’
./ppl.l:555: error: called object ‘yy_current_state’ is not a function
./ppl.l:561: error: ‘tSQSTRING’ undeclared (first use in this function)
./ppl.l:571: error: ‘tIQSTRING’ undeclared (first use in this function)
./ppl.l:601: warning: implicit declaration of function ‘string_start’
./ppl.l:608: error: ‘pp_entry_t’ undeclared (first use in this function)
./ppl.l:608: error: ‘ppp’ undeclared (first use in this function)
./ppl.l:610: warning: implicit declaration of function ‘pplookup’
./ppl.l:612: error: called object ‘yy_current_state’ is not a function
./ppl.l:615: error: called object ‘yy_current_state’ is not a function
./ppl.l:621: error: called object ‘yy_current_state’ is not a function
./ppl.l:621: error: ‘INITIAL’ undeclared (first use in this function)
./ppl.l:623: error: ‘tRCINCLUDE’ undeclared (first use in this function)
./ppl.l:632: error: ‘def_special’ undeclared (first use in this function)
./ppl.l:633: warning: implicit declaration of function ‘expand_special’
./ppl.l:635: error: ‘def_define’ undeclared (first use in this function)
./ppl.l:636: warning: implicit declaration of function ‘expand_define’
./ppl.l:638: error: ‘def_macro’ undeclared (first use in this function)
./ppl.l:639: error: ‘pp_macign’ undeclared (first use in this function)
./ppl.l:640: warning: implicit declaration of function ‘push_macro’
./ppl.l:643: warning: implicit declaration of function ‘internal_error’
./ppl.l:667: error: ‘tRCINCLUDEPATH’ undeclared (first use in this function)
./ppl.l:680: warning: implicit declaration of function ‘isprint’
./ppl.l:696: error: ‘pp_macexp’ undeclared (first use in this function)
./ppl.l:684: error: ‘bufferstackentry_t’ undeclared (first use in this function)
./ppl.l:684: error: ‘bep’ undeclared (first use in this function)
./ppl.l:684: warning: implicit declaration of function ‘pop_buffer’
./ppl.l:686: warning: implicit declaration of function ‘get_if_depth’
./ppl.l:699: warning: implicit declaration of function ‘expand_macro’
./ppl.l: At top level:
./ppl.l:730: warning: conflicting types for ‘newline’
./ppl.l:730: error: static declaration of ‘newline’ follows non-static declaration
./ppl.l:326: error: previous implicit declaration of ‘newline’ was here
./ppl.l: In function ‘newline’:
./ppl.l:731: error: ‘line_number’ undeclared (first use in this function)
./ppl.l:732: error: ‘char_number’ undeclared (first use in this function)
./ppl.l:737: error: ‘ncontinuations’ undeclared (first use in this function)
./ppl.l: At top level:
./ppl.l:770: error: expected declaration specifiers or ‘...’ before ‘YYSTYPE’
./ppl.l:771: error: static declaration of ‘make_number’ follows non-static declaration
./ppl.l:334: error: previous implicit declaration of ‘make_number’ was here
./ppl.l: In function ‘make_number’:
./ppl.l:778: warning: implicit declaration of function ‘toupper’
./ppl.l:812: error: ‘val’ undeclared (first use in this function)
./ppl.l:813: error: ‘tULONG’ undeclared (first use in this function)
./ppl.l:818: error: ‘tSLONG’ undeclared (first use in this function)
./ppl.l:823: error: ‘win32’ undeclared (first use in this function)
./ppl.l:827: error: ‘tUINT’ undeclared (first use in this function)
./ppl.l:841: error: ‘tSINT’ undeclared (first use in this function)
./ppl.l: At top level:
./ppl.l:852: error: expected ‘)’ before ‘*’ token
./ppl.l:901: error: expected ‘)’ before ‘*’ token
./ppl.l: In function ‘add_text’:
./ppl.l:929: error: ‘ALLOCBLOCKSIZE’ undeclared (first use in this function)
./ppl.l:930: warning: implicit declaration of function ‘xrealloc’
./ppl.l:930: warning: assignment makes pointer from integer without a cast
./ppl.l: At top level:
./ppl.l:938: error: expected ‘=’, ‘,’, ‘;’, ‘asm’ or ‘__attribute__’ before ‘*’ token
./ppl.l:1035: error: expected ‘)’ before ‘*’ token
./ppl.l:1114: warning: conflicting types for ‘new_string’
./ppl.l:1114: error: static declaration of ‘new_string’ follows non-static declaration
./ppl.l:335: error: previous implicit declaration of ‘new_string’ was here
./ppl.l: In function ‘new_string’:
./ppl.l:1119: error: ‘strbuf_idx’ undeclared (first use in this function)
./ppl.l:1120: error: ‘str_startline’ undeclared (first use in this function)
./ppl.l:1120: error: ‘line_number’ undeclared (first use in this function)
./ppl.l: At top level:
./ppl.l:1124: warning: conflicting types for ‘add_string’
./ppl.l:1124: error: static declaration of ‘add_string’ follows non-static declaration
./ppl.l:335: error: previous implicit declaration of ‘add_string’ was here
./ppl.l: In function ‘add_string’:
./ppl.l:1127: error: ‘strbuf_idx’ undeclared (first use in this function)
./ppl.l:1127: error: ‘strbuf_alloc’ undeclared (first use in this function)
./ppl.l:1129: error: ‘ALLOCBLOCKSIZE’ undeclared (first use in this function)
./ppl.l:1130: error: ‘strbuffer’ undeclared (first use in this function)
./ppl.l: At top level:
./ppl.l:1139: error: conflicting types for ‘get_string’
./ppl.l:545: error: previous implicit declaration of ‘get_string’ was here
./ppl.l: In function ‘get_string’:
./ppl.l:1140: warning: implicit declaration of function ‘xmalloc’
./ppl.l:1140: error: ‘strbuf_idx’ undeclared (first use in this function)
./ppl.l:1141: error: ‘strbuffer’ undeclared (first use in this function)
./ppl.l: At top level:
./ppl.l:1150: warning: conflicting types for ‘put_string’
./ppl.l:1150: error: static declaration of ‘put_string’ follows non-static declaration
./ppl.l:548: error: previous implicit declaration of ‘put_string’ was here
./ppl.l: In function ‘put_string’:
./ppl.l:1151: error: ‘strbuffer’ undeclared (first use in this function)
./ppl.l:1151: error: ‘strbuf_idx’ undeclared (first use in this function)
./ppl.l: At top level:
./ppl.l:1158: error: static declaration of ‘string_start’ follows non-static declaration
./ppl.l:601: error: previous implicit declaration of ‘string_start’ was here
./ppl.l: In function ‘string_start’:
./ppl.l:1159: error: ‘str_startline’ undeclared (first use in this function)
./ppl.l: At top level:
./ppl.l:1168: error: expected ‘)’ before ‘*’ token
./ppl.l:1206: error: expected ‘=’, ‘,’, ‘;’, ‘asm’ or ‘__attribute__’ before ‘*’ token
./ppl.l:1291: error: expected ‘)’ before ‘*’ token
./ppl.l:1302: error: expected ‘=’, ‘,’, ‘;’, ‘asm’ or ‘__attribute__’ before ‘*’ token
./ppl.l:1307: error: expected ‘=’, ‘,’, ‘;’, ‘asm’ or ‘__attribute__’ before ‘*’ token
./ppl.l:1314: error: expected ‘)’ before ‘*’ token
./ppl.l:1330: warning: conflicting types for ‘add_text_to_macro’
./ppl.l:1330: error: static declaration of ‘add_text_to_macro’ follows non-static declaration
./ppl.l:487: error: previous implicit declaration of ‘add_text_to_macro’ was here
./ppl.l: In function ‘add_text_to_macro’:
./ppl.l:1331: error: ‘macexpstackentry_t’ undeclared (first use in this function)
./ppl.l:1331: error: ‘mep’ undeclared (first use in this function)
./ppl.l:1331: warning: implicit declaration of function ‘top_macro’
./ppl.l:1333: warning: implicit declaration of function ‘assert’
./ppl.l:1337: warning: implicit declaration of function ‘max’
./ppl.l:1337: error: ‘ALLOCBLOCKSIZE’ undeclared (first use in this function)
./ppl.l: At top level:
./ppl.l:1346: warning: conflicting types for ‘macro_add_arg’
./ppl.l:1346: error: static declaration of ‘macro_add_arg’ follows non-static declaration
./ppl.l:493: error: previous implicit declaration of ‘macro_add_arg’ was here
./ppl.l: In function ‘macro_add_arg’:
./ppl.l:1349: error: ‘macexpstackentry_t’ undeclared (first use in this function)
./ppl.l:1349: error: ‘mep’ undeclared (first use in this function)
./ppl.l:1368: error: ‘debuglevel’ undeclared (first use in this function)
./ppl.l:1368: error: ‘DEBUGLEVEL_PPLEX’ undeclared (first use in this function)
./ppl.l:1370: error: ‘input_name’ undeclared (first use in this function)
./ppl.l:1371: error: ‘line_number’ undeclared (first use in this function)
./ppl.l:1378: error: ‘pp_macexp’ undeclared (first use in this function)
./ppl.l:1379: warning: implicit declaration of function ‘push_buffer’
./ppl.l: In function ‘macro_add_expansion’:
./ppl.l:1387: error: ‘macexpstackentry_t’ undeclared (first use in this function)
./ppl.l:1387: error: ‘mep’ undeclared (first use in this function)
./ppl.l:1396: error: ‘debuglevel’ undeclared (first use in this function)
./ppl.l:1396: error: ‘DEBUGLEVEL_PPLEX’ undeclared (first use in this function)
./ppl.l:1398: error: ‘input_name’ undeclared (first use in this function)
./ppl.l:1399: error: ‘line_number’ undeclared (first use in this function)
./ppl.l: At top level:
./ppl.l:1411: warning: conflicting types for ‘put_buffer’
./ppl.l:1411: error: static declaration of ‘put_buffer’ follows non-static declaration
./ppl.l:476: error: previous implicit declaration of ‘put_buffer’ was here
./ppl.l: In function ‘put_buffer’:
./ppl.l:1415: error: ‘pass_data’ undeclared (first use in this function)
./ppl.l: In function ‘do_include’:
./ppl.l:1439: error: ‘includelogicentry_t’ undeclared (first use in this function)
./ppl.l:1439: error: ‘iep’ undeclared (first use in this function)
./ppl.l:1441: error: ‘includelogiclist’ undeclared (first use in this function)
./ppl.l:1462: warning: implicit declaration of function ‘open_include’
./ppl.l:1462: warning: assignment makes pointer from integer without a cast
./ppl.l:1467: error: ‘seen_junk’ undeclared (first use in this function)
./ppl.l:1468: error: ‘include_state’ undeclared (first use in this function)
./ppl.l:1469: error: ‘include_ppp’ undeclared (first use in this function)
./ppl.l:1470: error: ‘pass_data’ undeclared (first use in this function)
./ppl.l:1473: error: ‘debuglevel’ undeclared (first use in this function)
./ppl.l:1473: error: ‘DEBUGLEVEL_PPMSG’ undeclared (first use in this function)
./ppl.l:1474: error: ‘input_name’ undeclared (first use in this function)
./ppl.l:1474: error: ‘line_number’ undeclared (first use in this function)
./ppl.l:1474: error: ‘include_ifdepth’ undeclared (first use in this function)
./ppl.l: In function ‘push_ignore_state’:
./ppl.l:1488: error: ‘pp_ignore’ undeclared (first use in this function)
make[2]: *** [lex.ppl.o] Error 1
make[2]: Leaving directory `/usr/src/winex/tools/wrc'
make[1]: *** [wrc] Error 2
make[1]: Leaving directory `/usr/src/winex/tools'
make: *** [tools] Error 2

Pouzivam Ubuntu 6.10

DISKUZE

Graficka ATI MOBILITY RADEON 9000 v Acer Aspire 1605DLC 11.4.2004 13:09 Croow
L Re: Graficka ATI MOBILITY RADEON 9000 v Acer Aspire 1605DLC 12.4.2004 16:17 Jaroslav Imrich
Soustenie wine 24.11.2004 19:57 ijohny
Error pri \\\\\\\\ 23.2.2007 23:22 Filip Cizek




Příspívat do diskuze mohou pouze registrovaní uživatelé.
> Vyhledávání software
> Vyhledávání článků

18.6.2018 0:43 /František Kučera
Červnový pražský sraz spolku OpenAlt se koná již tento čtvrtek – 21. 6. 2018 od 18:00 v Kavárně Ideál (Sázavská 30, Praha), kde máme rezervovaný salonek. Tentokrát na téma: F-Droid, aneb svobodný software do vašeho mobilu. Kromě toho budou k vidění i vývojové desky HiFive1 se svobodným/otevřeným čipem RISC-V.
Přidat komentář

23.5.2018 20:55 /Ondřej Čečák
Od pátku 25.5. proběhne na Fakultě informačních technologií ČVUT v Praze openSUSE Conference. Můžete se těšit na spostu zajímavých přednášek, workshopů a také na Release Party nového openSUSE leap 15.0. V na stejném místě proběhne v sobotu 26.5. i seminář o bezpečnosti CryptoFest.
Přidat komentář

20.5.2018 17:45 /Redakce Linuxsoft.cz
Ve čtvrtek 31. května 2018 připravuje webový magazín BusinessIT ve spolupráci s Best Online Média s.r.o. pátý ročník odborné konference Firemní informační systémy 2018. Akce proběhne v kongresovém centru Vavruška (palác Charitas), Karlovo náměstí 5, Praha 2 (u metra Karlovo náměstí) od 9:00 hod. dopoledne do cca 15 hod. odpoledne. Konference je zaměřena na efektivní využití firemních informačních systémů a na to, jak plně využít jejich potenciál. Podrobnější informace na webových stránkách konfrence.
Přidat komentář

14.5.2018 7:28 /František Kučera
Květnový pražský sraz spolku OpenAlt se koná již tento čtvrtek – 17. 5. 2018 od 18:00 v Kavárně Ideál (Sázavská 30, Praha), kde máme rezervovaný salonek. Tentokrát na téma: Audio – zvuk v GNU/Linuxu.
Přidat komentář

7.5.2018 16:20 /František Kučera
Na stránkách spolku OpenAlt vyšla fotoreportáž Pražské srazy 2017 dokumentující srazy za uplynulý rok. Květnový pražský sraz na téma audio se bude konat 17. 5. 2018 (místo a čas ještě upřesníme).
Přidat komentář

17.4.2018 0:46 /František Kučera
Dubnový pražský sraz spolku OpenAlt se koná již tento čtvrtek – 19. 4. 2018 od 18:00 v Kavárně Ideál (Sázavská 30, Praha), kde máme rezervovaný salonek. Tématem tohoto srazu bude OpenStreetMap (OSM) aneb svobodné mapy.
Přidat komentář

16.3.2018 22:01 /František Kučera
Kulatý OpenAlt sraz v Praze oslavíme klasicky: u limonády a piva! Přijďte si posedět, dát si dobré jídlo a vybrat z mnoha piv do restaurace Kulový blesk, který najdete v centru Prahy nedaleko metra I. P. Pavlova na adrese Sokolská 13, Praha 2. Sraz se koná ve čtvrtek 22. března a začínáme v 18:00. Heslo: OpenAlt. Vezměte s sebou svoje hračky! Uvítáme, když si s sebou na sraz vezmete svoje oblíbené hračky. Jestli máte nějaký drobný projekt postavený na Arduinu, nějakou zajímavou elektronickou součástku, či třeba i pěkný úlovek z crowdfundingové akce, neváhejte. Oslníte ostatní a o zábavu bude postaráno.
Přidat komentář

13.2.2018 0:41 /František Kučera
Únorový pražský sraz OpenAltu se koná 15. 2. 2018 a tentokrát se vydáme na návštěvu do jednoho pražského datacentra. Sejdeme se v 17:50 v severovýchodní části nástupiště tramvajové zastávky Koh-I-Noor. Po exkurzi se přesuneme do restaurace U Pštrosa (Moskevská 49), kde probereme tradiční témata (svobodný software a hardware, DIY, CNC, SDR, 3D tisk…) a tentokrát bude k vidění i IoT brána od The Things Network.
Přidat komentář

   Více ...   Přidat zprávičku

> Poslední diskuze

20.2.2018 18:48 / Ivan Majer
portal

20.2.2018 15:57 / Jan Havel
Jak využíváte služby cloudu v podnikání?

16.1.2018 1:08 / Ivan Pittner
verejna ip od o2 ubuntu

15.1.2018 17:26 / Mira Harvalik
Re: Jak udělat HTML/Javascript swiping gallery do mobilu?

30.12.2017 20:16 / Michal Knoll
odmocnina

Více ...

ISSN 1801-3805 | Provozovatel: Pavel Kysilka, IČ: 72868490 (2003-2018) | mail at linuxsoft dot cz | Design: www.megadesign.cz | Textová verze